Boost failed updating 1 target Uncencored sex cams chat

o libs\config\checks\architecture.cpp:: error: size of array 'test' is negative int test[sizeof(void*) == 4? Performing configuration checks - 32-bit : no ...found 2 targets... gcc.compile.c C:\boost-filesystem\boost\architecture\gcc-mingw-5.1.0\debug.

die "Building of Boost tools failed"; * * If you need support, post the output of `emerge --info '=dev-libs/boost-1.55.0-r1::gentoo'`, * the complete build log and the output of `emerge -pqv '=dev-libs/boost-1.55.0-r1::gentoo'`. ------------------------------------------------------------ /home/uwe/mxe-git-qt5/usr/bin/i686-w64-mingw32.static-ld: cannot find -lboost_system-mt /home/uwe/mxe-git-qt5/usr/bin/i686-w64-mingw32.static-ld: cannot find -lboost_chrono-mt collect2: error: ld returned 1 exit status Makefile:438: recipe for target 'build-only-boost_i686-w64-mingw32.static' failed make[1]: *** [build-only-boost_i686-w64-mingw32.static] Error 1 I know this topic is closed but I wanted to post a comment saying I'm also having an error compiling boost. make[1]: *** [build-only-boost_x86_64-w64-mingw32.shared] Error 1 make[1]: Leaving directory `/opt/mxe' real 7m56.284s user 6m47.049s sys 0m32.842s [log] /opt/mxe/log/boost make: *** [/opt/mxe/usr/x86_64-w64-mingw32.shared/installed/boost] Error 1 Wait, I noticed something, somewhere along the line it said virtual memory exhausted.

993

Leave a Reply